Reaction Details
TargetRetinoic acid receptor alpha
LigandBDBM50097821
Substrate/Competitorn/a
Meas. Tech.ChEMBL_195314 (CHEMBL799869)
IC50 220±n/a nM
Citation Beard, RLKlein, ESStandeven, AMEscobar, MChandraratna, RA Phenylcyclohexene and phenylcyclohexadiene substituted compounds having retinoid antagonist activity. Bioorg Med Chem Lett11:765-8 (2001) Retinoic acid receptor alpha
Name:Retinoic acid receptor alpha
Type:PROTEIN
Mol. Mass.:50778.87
Organism:Homo sapiens (Human)
Description:ChEMBL_1466191
Residue:462
BDBM50097821
NameBDBM50097821
Synonyms:4-{(E)-4-[2-(4-Ethyl-phenyl)-6,6-dimethyl-cyclohex-1-enyl]-but-3-en-1-ynyl}-benzoic acid | CHEMBL349935
TypeSmall organic molecule
Emp. Form.C27H28O2
Mol. Mass.384.51
SMILESCCc1ccc(cc1)C1=C(\C=C\C#Cc2ccc(cc2)C(O)=O)C(C)(C)CCC1