Reaction Details
TargetProto-oncogene tyrosine-protein kinase Src
LigandBDBM50097967
Substrate/Competitorn/a
Meas. Tech.ChEBML_221672
IC50 1±n/a nM
Citation Altmann, EMissbach, MGreen, JSusa, MWagenknecht, HAWidler, L 7-Pyrrolidinyl- and 7-piperidinyl-5-aryl-pyrrolo[2,3-d]pyrimidines--potent inhibitors of the tyrosine kinase c-Src. Bioorg Med Chem Lett11:853-6 (2001) Proto-oncogene tyrosine-protein kinase Src
Name:Proto-oncogene tyrosine-protein kinase Src
Type:Protein
Mol. Mass.:59838.60
Organism:Homo sapiens (Human)
Description:P12931
Residue:536
BDBM50097967
NameBDBM50097967
Synonyms:3-(4-amino-7-(1-(2-hydroxyethyl)piperidin-4-yl)-7H-pyrrolo[2,3-d]pyrimidin-5-yl)phenol CHEMBL169780
TypeSmall organic molecule
Emp. Form.C19H23N5O2
Mol. Mass.353.4182
SMILESNc1ncnc2n(cc(-c3cccc(O)c3)c12)C1CCN(CCO)CC1