Reaction Details
TargetMuscarinic acetylcholine receptor M2
LigandBDBM50092959
Substrate/Competitorn/a
Meas. Tech.ChEBML_139761
Ki 0.110000±n/a nM
Citation Wang, YChackalamannil, SChang, WGreenlee, WRuperto, VDuffy, RAMcQuade, RLachowicz, JE Design and synthesis of ether analogues as potent and selective M2 muscarinic receptor antagonists. Bioorg Med Chem Lett11:891-4 (2001) Muscarinic acetylcholine receptor M2
Name:Muscarinic acetylcholine receptor M2
Type:GPCR
Mol. Mass.:51730.61
Organism:Homo sapiens (Human)
Description:P08172
Residue:466
BDBM50092959
NameBDBM50092959
Synonyms:4-{1-[4-(4-Methoxy-benzenesulfonyl)-phenyl]-vinyl}-[1,4']bipiperidinyl-1'-carboxylic acid ethyl ester ethyl 4-(4-(1-(4-(4-methoxyphenylsulfonyl)phenyl)vinyl)piperidin-1-yl)piperidine-1-carboxylate
TypeSmall organic molecule
Emp. Form.C28H36N2O5S
Mol. Mass.512.661
SMILESCCOC(=O)N1CCC(CC1)N1CCC(CC1)C(=C)c1ccc(cc1)S(=O)(=O)c1ccc(OC)cc1