Reaction Details
TargetMuscarinic acetylcholine receptor M2
LigandBDBM50098086
Substrate/Competitorn/a
Meas. Tech.ChEBML_139761
Ki 0.200000±n/a nM
Citation Wang, YChackalamannil, SChang, WGreenlee, WRuperto, VDuffy, RAMcQuade, RLachowicz, JE Design and synthesis of ether analogues as potent and selective M2 muscarinic receptor antagonists. Bioorg Med Chem Lett11:891-4 (2001) Muscarinic acetylcholine receptor M2
Name:Muscarinic acetylcholine receptor M2
Type:GPCR
Mol. Mass.:51730.61
Organism:Homo sapiens (Human)
Description:P08172
Residue:466
BDBM50098086
NameBDBM50098086
Synonyms:CHEMBL174070 | {4-[4-(Benzo[1,3]dioxole-5-sulfonyl)-phenoxy]-[1,4']bipiperidinyl-1'-yl}-(3-methyl-thiophen-2-yl)-methanone
TypeSmall organic molecule
Emp. Form.C29H32N2O6S2
Mol. Mass.568.704
SMILESCc1ccsc1C(=O)N1CCC(CC1)N1CCC(CC1)Oc1ccc(cc1)S(=O)(=O)c1ccc2OCOc2c1