Reaction Details
TargetMuscarinic acetylcholine receptor M2
LigandBDBM50098091
Substrate/Competitorn/a
Meas. Tech.ChEBML_139761
Ki 1.1±n/a nM
Citation Wang, YChackalamannil, SChang, WGreenlee, WRuperto, VDuffy, RAMcQuade, RLachowicz, JE Design and synthesis of ether analogues as potent and selective M2 muscarinic receptor antagonists. Bioorg Med Chem Lett11:891-4 (2001) Muscarinic acetylcholine receptor M2
Name:Muscarinic acetylcholine receptor M2
Type:GPCR
Mol. Mass.:51730.61
Organism:Homo sapiens (Human)
Description:P08172
Residue:466
BDBM50098091
NameBDBM50098091
Synonyms:4-[4-(Benzo[1,3]dioxole-5-sulfonyl)-phenoxy]-[1,4']bipiperidinyl-1'-carboxylic acid phenyl ester | CHEMBL422740
TypeSmall organic molecule
Emp. Form.C30H32N2O7S
Mol. Mass.564.649
SMILESO=C(Oc1ccccc1)N1CCC(CC1)N1CCC(CC1)Oc1ccc(cc1)S(=O)(=O)c1ccc2OCOc2c1