Reaction Details
TargetHeat shock protein HSP 90-alpha
LigandBDBM50098125
Substrate/Competitorn/a
Meas. Tech.ChEBML_84818
EC50 4000±n/a nM
Citation Chiosis, GRosen, NSepp-Lorenzino, L LY294002-geldanamycin heterodimers as selective inhibitors of the PI3K and PI3K-related family. Bioorg Med Chem Lett11:909-13 (2001) Heat shock protein HSP 90-alpha
Name:Heat shock protein HSP 90-alpha
Type:Molecular Chaperone
Mol. Mass.:84623.45
Organism:Homo sapiens (Human)
Description:P07900
Residue:732
BDBM50098125
NameBDBM50098125
Synonyms:CHEMBL355195 | Carbamic acid 13-hydroxy-8,14-dimethoxy-4,10,12,16-tetramethyl-19-[6-(2-morpholin-4-yl-4-oxo-4H-chromen-7-yloxy)-hexylamino]-3,20,22-trioxo-2-aza-bicyclo[16.3.1]docosa-1(21),4,6,10,18-pentaen-9-yl ester
TypeSmall organic molecule
Emp. Form.C47H62N4O12
Mol. Mass.875.0148
SMILESCO[C@H]1C[C@H](C)Cc2c(O)c(NC(=O)C(C)=CC=C[C@H](OC)[C@@H](OC(N)=O)\C(C)=C\[C@H](C)[C@H]1O)cc(O)c2N=CCCCCCOc1ccc2c(c1)oc(cc2=O)N1CCOCC1