Reaction Details
TargetUrokinase-type plasminogen activator
LigandBDBM50098127
Substrate/Competitorn/a
Meas. Tech.ChEBML_213156
Ki 110±n/a nM
Citation Wilson, KJIllig, CRSubasinghe, NHoffman, JBRudolph, MJSoll, RMolloy, CJBone, RGreen, DRandall, TZhang, MLewandowski, FAZhou, ZSharp, CMaguire, DGrasberger, BDesJarlais, RLSpurlino, J Synthesis of thiophene-2-carboxamidines containing 2-aminothiazoles and their biological evaluation as urokinase inhibitors. Bioorg Med Chem Lett11:915-8 (2001) Urokinase-type plasminogen activator
Name:Urokinase-type plasminogen activator
Type:Enzyme
Mol. Mass.:48528.62
Organism:Homo sapiens (Human)
Description:P00749
Residue:431
BDBM50098127
NameBDBM50098127
Synonyms:4-[2-(4-Cyclohexyl-phenylamino)-thiazol-4-yl]-5-methylsulfanyl-thiophene-2-carboxamidine | CHEMBL353872
TypeSmall organic molecule
Emp. Form.C21H24N4S3
Mol. Mass.428.637
SMILESCSc1sc(cc1-c1csc(Nc2ccc(cc2)C2CCCCC2)n1)C(N)=N