Reaction Details
TargetHistamine H3 receptor
LigandBDBM27213
Substrate/Competitorn/a
Meas. Tech.ChEBML_83643
Ki 46±n/a nM
Citation Stark, HSippl, WLigneau, XArrang, JMGanellin, CRSchwartz, JCSchunack, W Different antagonist binding properties of human and rat histamine H3 receptors. Bioorg Med Chem Lett11:951-4 (2001) Histamine H3 receptor
Name:Histamine H3 receptor
Type:G Protein-Coupled Receptor (GPCR)
Mol. Mass.:48691.47
Organism:Homo sapiens (Human)
Description:Binding assays were using CHO cells stably expressing hH3R receptors.
Residue:445
BDBM27213
NameBDBM27213
Synonyms:4-[3-(4-cyclopropanecarbonylphenoxy)propyl]-1H-imidazole CHEMBL1795025 | Ciproxifan
TypeSmall organic molecule
Emp. Form.C16H18N2O2
Mol. Mass.270.3263
SMILESO=C(C1CC1)c1ccc(OCCCc2cnc[nH]2)cc1