Reaction Details
TargetHistamine H3 receptor
LigandBDBM50098205
Substrate/Competitorn/a
Meas. Tech.ChEBML_86751
Ki 44±n/a nM
Citation Stark, HSippl, WLigneau, XArrang, JMGanellin, CRSchwartz, JCSchunack, W Different antagonist binding properties of human and rat histamine H3 receptors. Bioorg Med Chem Lett11:951-4 (2001) Histamine H3 receptor
Name:Histamine H3 receptor
Type:G Protein-Coupled Receptor (GPCR)
Mol. Mass.:48607.98
Organism:Rattus norvegicus (rat)
Description:n/a
Residue:445
BDBM50098205
NameBDBM50098205
Synonyms:1-{4-[3-(1H-Imidazol-4-yl)-propylsulfanyl]-phenyl}-ethanone | CHEMBL424365
TypeSmall organic molecule
Emp. Form.C14H16N2OS
Mol. Mass.260.355
SMILESCC(=O)c1ccc(SCCCc2cnc[nH]2)cc1