Reaction Details
TargetHistamine H3 receptor
LigandBDBM50098207
Substrate/Competitorn/a
Meas. Tech.ChEBML_83643
Ki 19±n/a nM
Citation Stark, HSippl, WLigneau, XArrang, JMGanellin, CRSchwartz, JCSchunack, W Different antagonist binding properties of human and rat histamine H3 receptors. Bioorg Med Chem Lett11:951-4 (2001) Histamine H3 receptor
Name:Histamine H3 receptor
Type:G Protein-Coupled Receptor (GPCR)
Mol. Mass.:48691.47
Organism:Homo sapiens (Human)
Description:Binding assays were using CHO cells stably expressing hH3R receptors.
Residue:445
BDBM50098207
NameBDBM50098207
Synonyms:1-{4-[4-(1H-Imidazol-4-yl)-butoxy]-phenyl}-ethanone | CHEMBL368948
TypeSmall organic molecule
Emp. Form.C15H18N2O2
Mol. Mass.258.3156
SMILESCC(=O)c1ccc(OCCCCc2cnc[nH]2)cc1