Reaction Details
TargetHistamine H3 receptor
LigandBDBM22916
Substrate/Competitorn/a
Meas. Tech.ChEBML_83643
Ki 41±n/a nM
Citation Stark, HSippl, WLigneau, XArrang, JMGanellin, CRSchwartz, JCSchunack, W Different antagonist binding properties of human and rat histamine H3 receptors. Bioorg Med Chem Lett11:951-4 (2001) Histamine H3 receptor
Name:Histamine H3 receptor
Type:G Protein-Coupled Receptor (GPCR)
Mol. Mass.:48691.47
Organism:Homo sapiens (Human)
Description:Binding assays were using CHO cells stably expressing hH3R receptors.
Residue:445
BDBM22916
NameBDBM22916
Synonyms:5-{3-[(4-iodophenyl)methoxy]propyl}-1H-imidazole Iodoproxyfan
TypeSmall organic molecule
Emp. Form.C13H15IN2O
Mol. Mass.342.1755
SMILESIc1ccc(COCCCc2cnc[nH]2)cc1