Reaction Details
TargetMicrosomal triglyceride transfer protein large subunit
LigandBDBM50098322
Substrate/Competitorn/a
Meas. Tech.ChEMBL_103132 (CHEMBL712302)
IC50 1±n/a nM
Citation Robl, JASulsky, RSun, CQSimpkins, LMWang, TDickson, JKChen, YMagnin, DRTaunk, PSlusarchyk, WABiller, SALan, SJConnolly, FKunselman, LKSabrah, TJamil, HGordon, DHarrity, TWWetterau, JR A novel series of highly potent benzimidazole-based microsomal triglyceride transfer protein inhibitors. J Med Chem44:851-6 (2001) Microsomal triglyceride transfer protein large subunit
Name:Microsomal triglyceride transfer protein large subunit
Type:PROTEIN
Mol. Mass.:99365.65
Organism:Homo sapiens (Human)
Description:ChEMBL_971724
Residue:894
BDBM50098322
NameBDBM50098322
Synonyms:9-(4-{5-Methyl-4-[(4'-trifluoromethyl-biphenyl-2-carbonyl)-amino]-benzoimidazol-1-yl}-butyl)-9H-fluorene-9-carboxylic acid (2,2,2-trifluoro-ethyl)-amide | CHEMBL355892
TypeSmall organic molecule
Emp. Form.C42H34F6N4O2
Mol. Mass.740.7354
SMILESCc1ccc2n(CCCCC3(C(=O)NCC(F)(F)F)c4ccccc4-c4ccccc34)cnc2c1NC(=O)c1ccccc1-c1ccc(cc1)C(F)(F)F