Reaction Details
TargetVascular cell adhesion protein 1
LigandBDBM50098517
Substrate/Competitorn/a
Meas. Tech.ChEMBL_213817 (CHEMBL815900)
IC50>1000±n/a nM
Citation Stewart, AOBhatia, PAMcCarty, CMPatel, MVStaeger, MAArendsen, DLGunawardana, IWMelcher, LMZhu, GDBoyd, SAFry, DGCool, BLKifle, LLartey, KMarsh, KCKempf-Grote, AJKilgannon, PWisdom, WMeyer, JGallatin, WMOkasinski, GF Discovery of inhibitors of cell adhesion molecule expression in human endothelial cells. 1. Selective inhibition of ICAM-1 and E-selectin expression. J Med Chem44:988-1002 (2001) Vascular cell adhesion protein 1
Name:Vascular cell adhesion protein 1
Type:Other Protein Type
Mol. Mass.:81259.16
Organism:Homo sapiens (Human)
Description:P19320
Residue:739
BDBM50098517
NameBDBM50098517
Synonyms:4-(3,4-Dimethyl-phenylsulfanyl)-thieno[2,3-c]pyridine-2-carboxylic acid amide | CHEMBL267125
TypeSmall organic molecule
Emp. Form.C16H14N2OS2
Mol. Mass.314.425
SMILESCc1ccc(Sc2cncc3sc(cc23)C(N)=O)cc1C