Reaction Details
TargetE-selectin
LigandBDBM50098524
Substrate/Competitorn/a
Meas. Tech.ChEMBL_199704 (CHEMBL803587)
IC50 20±n/a nM
Citation Stewart, AOBhatia, PAMcCarty, CMPatel, MVStaeger, MAArendsen, DLGunawardana, IWMelcher, LMZhu, GDBoyd, SAFry, DGCool, BLKifle, LLartey, KMarsh, KCKempf-Grote, AJKilgannon, PWisdom, WMeyer, JGallatin, WMOkasinski, GF Discovery of inhibitors of cell adhesion molecule expression in human endothelial cells. 1. Selective inhibition of ICAM-1 and E-selectin expression. J Med Chem44:988-1002 (2001) E-selectin
Name:E-selectin
Type:PROTEIN
Mol. Mass.:66642.96
Organism:Homo sapiens (Human)
Description:ChEMBL_1438995
Residue:610
BDBM50098524
NameBDBM50098524
Synonyms:4-Phenylsulfanyl-thieno[2,3-c]pyridine-2-carboxylic acid amide | CHEMBL267456
TypeSmall organic molecule
Emp. Form.C14H10N2OS2
Mol. Mass.286.372
SMILESNC(=O)c1cc2c(Sc3ccccc3)cncc2s1