Reaction Details
TargetE-selectin
LigandBDBM50098470
Substrate/Competitorn/a
Meas. Tech.ChEMBL_199704 (CHEMBL803587)
IC50 150±n/a nM
Citation Stewart, AOBhatia, PAMcCarty, CMPatel, MVStaeger, MAArendsen, DLGunawardana, IWMelcher, LMZhu, GDBoyd, SAFry, DGCool, BLKifle, LLartey, KMarsh, KCKempf-Grote, AJKilgannon, PWisdom, WMeyer, JGallatin, WMOkasinski, GF Discovery of inhibitors of cell adhesion molecule expression in human endothelial cells. 1. Selective inhibition of ICAM-1 and E-selectin expression. J Med Chem44:988-1002 (2001) E-selectin
Name:E-selectin
Type:PROTEIN
Mol. Mass.:66642.96
Organism:Homo sapiens (Human)
Description:ChEMBL_1438995
Residue:610
BDBM50098470
NameBDBM50098470
Synonyms:4-p-Tolylsulfanyl-thieno[2,3-c]pyridine-2-carbothioic acid amide | CHEMBL266429
TypeSmall organic molecule
Emp. Form.C15H12N2S3
Mol. Mass.316.464
SMILESCc1ccc(Sc2cncc3sc(cc23)C(N)=S)cc1