Reaction Details
TargetD(2) dopamine receptor
LigandBDBM50098551
Substrate/Competitorn/a
Meas. Tech.ChEMBL_62883 (CHEMBL673593)
Ki 316±n/a nM
Citation Linnanen, TBrisander, MUnelius, LRosqvist, SNordvall, GHacksell, UJohansson, AM Atropisomeric derivatives of 2',6'-disubstituted (R)-11-phenylaporphine: selective serotonin 5-HT(7) receptor antagonists. J Med Chem44:1337-40 (2001) D(2) dopamine receptor
Name:D(2) dopamine receptor
Type:Cell-surface receptors
Mol. Mass.:50647.10
Organism:Homo sapiens (Human)
Description:P14416
Residue:443
BDBM50098551
NameBDBM50098551
Synonyms:(R)-3-(2-(2-(4-methylpiperidin-1-yl)ethyl)pyrrolidin-1-ylsulfonyl)phenol 3-{(R)-2-[2-(4-Methyl-piperidin-1-yl)-ethyl]-pyrrolidine-1-sulfonyl}-phenol 3-{2-[2-(4-Methyl-piperidin-1-yl)-ethyl]-pyrrolidine-1-sulfonyl}-phenol CHEMBL282199 | SB-269970
TypeSmall organic molecule
Emp. Form.C18H28N2O3S
Mol. Mass.352.492
SMILESCC1CCN(CC[C@H]2CCCN2S(=O)(=O)c2cccc(O)c2)CC1