Reaction Details
TargetProthrombin
LigandBDBM50015234
Substrate/Competitorn/a
Meas. Tech.ChEMBL_208675 (CHEMBL813334)
Ki 224±n/a nM
Citation Enyedy, IJLee, SLKuo, AHDickson, RBLin, CYWang, S Structure-based approach for the discovery of bis-benzamidines as novel inhibitors of matriptase. J Med Chem44:1349-55 (2001) Prothrombin
Name:Prothrombin
Type:Protein
Mol. Mass.:70029.57
Organism:Homo sapiens (Human)
Description:P00734
Residue:622
BDBM50015234
NameBDBM50015234
Synonyms:4,4''[1,6-HEXANEDIYLBIS(OXY)]BISBENZENECARBOXIMIDAMIDE 4-{6-[4-amino(imino)methylphenoxy]hexyloxy}phenyl-iminomethanamine CHEMBL25105 US9138393, Hexamidine diisethionate | US9144538, Hexamidine diisethionate
TypeSmall organic molecule
Emp. Form.C20H26N4O2
Mol. Mass.354.446
SMILESNC(=N)c1ccc(OCCCCCCOc2ccc(cc2)C(N)=N)cc1