Reaction Details
TargetCathepsin B
LigandBDBM50098579
Substrate/Competitorn/a
Meas. Tech.ChEMBL_216562 (CHEMBL822277)
Ki>1000±n/a nM
Citation Marquis, RWRu, YLoCastro, SMZeng, JYamashita, DSOh, HJErhard, KFDavis, LDTomaszek, TATew, DSalyers, KProksch, JWard, KSmith, BLevy, MCummings, MDHaltiwanger, RCTrescher, GWang, BHemling, MEQuinn, CJCheng, HYLin, FSmith, WWJanson, CAZhao, BMcQueney, MSD'Alessio, KLee, CPMarzulli, ADodds, RABlake, SHwang, SMJames, IEGress, CJBradley, BRLark, MWGowen, MVeber, DF Azepanone-based inhibitors of human and rat cathepsin K. J Med Chem44:1380-95 (2001) Cathepsin B
Name:Cathepsin B
Type:Enzyme
Mol. Mass.:37819.69
Organism:Homo sapiens (Human)
Description:gi_63102437
Residue:339
BDBM50098579
NameBDBM50098579
Synonyms:CHEMBL29483 | {1-[3-(2-Benzyloxycarbonylamino-4-methyl-pentanoylamino)-4-oxo-pyrrolidine-1-carbonyl]-3-methyl-butyl}-carbamic acid benzyl ester
TypeSmall organic molecule
Emp. Form.C32H42N4O7
Mol. Mass.594.6985
SMILESCC(C)C[C@@H](NC(=O)OCc1ccccc1)C(=O)NC1CN(CC1=O)C(=O)[C@H](CC(C)C)NC(=O)OCc1ccccc1