Reaction Details
TargetCathepsin S
LigandBDBM19782
Substrate/Competitorn/a
Meas. Tech.ChEMBL_216712 (CHEMBL818677)
Ki 20±n/a nM
Citation Marquis, RWRu, YLoCastro, SMZeng, JYamashita, DSOh, HJErhard, KFDavis, LDTomaszek, TATew, DSalyers, KProksch, JWard, KSmith, BLevy, MCummings, MDHaltiwanger, RCTrescher, GWang, BHemling, MEQuinn, CJCheng, HYLin, FSmith, WWJanson, CAZhao, BMcQueney, MSD'Alessio, KLee, CPMarzulli, ADodds, RABlake, SHwang, SMJames, IEGress, CJBradley, BRLark, MWGowen, MVeber, DF Azepanone-based inhibitors of human and rat cathepsin K. J Med Chem44:1380-95 (2001) Cathepsin S
Name:Cathepsin S
Type:Protein
Mol. Mass.:37507.38
Organism:Homo sapiens (Human)
Description:P25774
Residue:331
BDBM19782
NameBDBM19782
Synonyms:(2S)-2-(1-benzofuran-2-ylformamido)-4-methyl-N-[(2S)-3-oxo-4-(pyridine-2-sulfonamido)butan-2-yl]pentanamide ketone, 1
TypeSmall organic molecule
Emp. Form.C24H28N4O6S
Mol. Mass.500.567
SMILESCC(C)C[C@H](NC(=O)c1cc2ccccc2o1)C(=O)N[C@@H](C)C(=O)CNS(=O)(=O)c1ccccn1