Reaction Details
TargetProcathepsin L
LigandBDBM50098575
Substrate/Competitorn/a
Meas. Tech.ChEMBL_216711 (CHEMBL818676)
Ki 16±n/a nM
Citation Marquis, RWRu, YLoCastro, SMZeng, JYamashita, DSOh, HJErhard, KFDavis, LDTomaszek, TATew, DSalyers, KProksch, JWard, KSmith, BLevy, MCummings, MDHaltiwanger, RCTrescher, GWang, BHemling, MEQuinn, CJCheng, HYLin, FSmith, WWJanson, CAZhao, BMcQueney, MSD'Alessio, KLee, CPMarzulli, ADodds, RABlake, SHwang, SMJames, IEGress, CJBradley, BRLark, MWGowen, MVeber, DF Azepanone-based inhibitors of human and rat cathepsin K. J Med Chem44:1380-95 (2001) Procathepsin L
Name:Procathepsin L
Type:Enzyme
Mol. Mass.:37557.19
Organism:Homo sapiens (Human)
Description:Purchased from Calbiochem (San Diego, CA).
Residue:333
BDBM50098575
NameBDBM50098575
Synonyms:CHEMBL281086 | {1-[4-(2-Benzyloxycarbonylamino-4-methyl-pentanoylamino)-3-oxo-piperidine-1-carbonyl]-3-methyl-butyl}-carbamic acid benzyl ester
TypeSmall organic molecule
Emp. Form.C33H44N4O7
Mol. Mass.608.7251
SMILESCC(C)C[C@@H](NC(=O)OCc1ccccc1)C(=O)NC1CCN(CC1=O)C(=O)[C@H](CC(C)C)NC(=O)OCc1ccccc1