Reaction Details
TargetSomatostatin receptor type 4
LigandBDBM50098615
Substrate/Competitorn/a
Meas. Tech.ChEMBL_200840 (CHEMBL807050)
Kd>1000±n/a nM
Citation Rajeswaran, WGHocart, SJMurphy, WATaylor, JECoy, DH N-Methyl scan of somatostatin octapeptide agonists produces interesting effects on receptor subtype specificity. J Med Chem44:1416-21 (2001) Somatostatin receptor type 4
Name:Somatostatin receptor type 4
Type:Enzyme
Mol. Mass.:42015.38
Organism:Homo sapiens (Human)
Description:P31391
Residue:388
BDBM50098615
NameBDBM50098615
Synonyms:10-(4-Amino-butyl)-19-(2-amino-3-phenyl-propionylamino)-16-benzyl-7-(1-hydroxy-ethyl)-13-(1H-indol-3-ylmethyl)-14-methyl-6,9,12,15,18-pentaoxo-1,2-dithia-5,8,11,14,17-pentaaza-cycloicosane-4-carboxylic acid (1-carbamoyl-2-hydroxy-propyl)-amide | CHEMBL407209
TypeSmall organic molecule
Emp. Form.C50H67N11O10S2
Mol. Mass.1046.265
SMILESC[C@@H](O)[C@H](NC(=O)[C@@H]1CSSC[C@@H](NC(=O)[C@H](N)Cc2ccccc2)C(=O)N[C@@H](Cc2ccccc2)C(=O)N(C)[C@@H](Cc2c[nH]c3ccccc23)C(=O)N[C@@H](CCCCN)C(=O)N[C@@H]([C@@H](C)O)C(=O)N1)C(N)=O