Reaction Details
TargetC-C chemokine receptor type 1
LigandBDBM50098634
Substrate/Competitorn/a
Meas. Tech.ChEMBL_218695 (CHEMBL821481)
IC50 2100±n/a nM
Citation Naya, ASagara, YOhwaki, KSaeki, TIchikawa, DIwasawa, YNoguchi, KOhtake, N Design, synthesis, and discovery of a novel CCR1 antagonist. J Med Chem44:1429-35 (2001) C-C chemokine receptor type 1
Name:C-C chemokine receptor type 1
Type:PROTEIN
Mol. Mass.:40904.59
Organism:Mus musculus
Description:ChEMBL_1452291
Residue:355
BDBM50098634
NameBDBM50098634
Synonyms:1-Cyclooctylmethyl-1-methyl-4-[(9H-xanthene-9-carbonyl)-amino]-piperidinium; iodide | CHEMBL34165
TypeSmall organic molecule
Emp. Form.C29H39N2O2
Mol. Mass.447.6316
SMILESC[N+]1(CC2CCCCCCC2)CCC(CC1)NC(=O)C1c2ccccc2Oc2ccccc12