Reaction Details
TargetC-C chemokine receptor type 1
LigandBDBM50098642
Substrate/Competitorn/a
Meas. Tech.ChEMBL_220711 (CHEMBL843656)
IC50 5±n/a nM
Citation Naya, ASagara, YOhwaki, KSaeki, TIchikawa, DIwasawa, YNoguchi, KOhtake, N Design, synthesis, and discovery of a novel CCR1 antagonist. J Med Chem44:1429-35 (2001) C-C chemokine receptor type 1
Name:C-C chemokine receptor type 1
Type:Enzyme
Mol. Mass.:41180.69
Organism:Homo sapiens (Human)
Description:P32246
Residue:355
BDBM50098642
NameBDBM50098642
Synonyms:1-Butyl-1-cyclooctylmethyl-4-[(9H-xanthene-9-carbonyl)-amino]-piperidinium; iodide | CHEMBL32713
TypeSmall organic molecule
Emp. Form.C32H45N2O2
Mol. Mass.489.7114
SMILESCCCC[N+]1(CC2CCCCCCC2)CCC(CC1)NC(=O)C1c2ccccc2Oc2ccccc12