Reaction Details
TargetC-C chemokine receptor type 1
LigandBDBM50098640
Substrate/Competitorn/a
Meas. Tech.ChEMBL_220711 (CHEMBL843656)
IC50 51±n/a nM
Citation Naya, ASagara, YOhwaki, KSaeki, TIchikawa, DIwasawa, YNoguchi, KOhtake, N Design, synthesis, and discovery of a novel CCR1 antagonist. J Med Chem44:1429-35 (2001) C-C chemokine receptor type 1
Name:C-C chemokine receptor type 1
Type:Enzyme
Mol. Mass.:41180.69
Organism:Homo sapiens (Human)
Description:P32246
Residue:355
BDBM50098640
NameBDBM50098640
Synonyms:9H-Xanthene-9-carboxylic acid (1-cyclooct-1-enylmethyl-piperidin-4-yl)-amide | CHEMBL33277
TypeSmall organic molecule
Emp. Form.C28H34N2O2
Mol. Mass.430.5818
SMILESO=C(NC1CCN(C\C2=C\CCCCCC2)CC1)C1c2ccccc2Oc2ccccc12