Reaction Details
TargetC-C chemokine receptor type 1
LigandBDBM50098622
Substrate/Competitorn/a
Meas. Tech.ChEMBL_220711 (CHEMBL843656)
IC50 800±n/a nM
Citation Naya, ASagara, YOhwaki, KSaeki, TIchikawa, DIwasawa, YNoguchi, KOhtake, N Design, synthesis, and discovery of a novel CCR1 antagonist. J Med Chem44:1429-35 (2001) C-C chemokine receptor type 1
Name:C-C chemokine receptor type 1
Type:Enzyme
Mol. Mass.:41180.69
Organism:Homo sapiens (Human)
Description:P32246
Residue:355
BDBM50098622
NameBDBM50098622
Synonyms:1-Cyclooctylmethyl-4-diphenylacetylamino-1-methyl-piperidinium; iodide | CHEMBL33761
TypeSmall organic molecule
Emp. Form.C29H41N2O
Mol. Mass.433.6481
SMILESC[N+]1(CC2CCCCCCC2)CCC(CC1)NC(=O)C(c1ccccc1)c1ccccc1