Reaction Details
TargetIntegrin alpha-L/beta-2
LigandBDBM50098751
Substrate/Competitorn/a
Meas. Tech.ChEMBL_96787 (CHEMBL703097)
Kd 8000000±n/a nM
Citation Liu, GHuth, JROlejniczak, ETMendoza, RDeVries, PLeitza, SReilly, EBOkasinski, GFFesik, SWvon Geldern, TW Novel p-arylthio cinnamides as antagonists of leukocyte function-associated antigen-1/intracellular adhesion molecule-1 interaction. 2. Mechanism of inhibition and structure-based improvement of pharmaceutical properties. J Med Chem44:1202-10 (2001) Integrin alpha-L/beta-2
Name:Integrin alpha-L/beta-2
Type:n/a
Mol. Mass.:n/a
Description:ASSAY_ID of EBI is 32646
Components:This complex has 2 components.
Component 1
Name:Integrin alpha-L
Synonyms:CD11 antigen-like family member A CD_antigen=CD11a ITGAL LFA-1A Leukocyte adhesion glycoprotein LFA-1 alpha chain | Leukocyte function-associated molecule 1 alpha chain
Type:PROTEIN
Mol. Mass.:128748.90
Organism:Homo sapiens (Human)
Description:ChEMBL_629045
Residue:1170
Component 2
Name:Integrin beta-2
Synonyms:CD18 ITGB2 MFI7
Type:PROTEIN
Mol. Mass.:84785.60
Organism:Homo sapiens (Human)
Description:EBI_12662
Residue:769
BDBM50098751
NameBDBM50098751
Synonyms:Benzo[1,2,5]thiadiazole | CHEMBL283327
TypeSmall organic molecule
Emp. Form.C6H4N2S
Mol. Mass.136.174
SMILESc1ccc2nsnc2c1