Reaction Details
TargetIntegrin alpha-L/beta-2
LigandBDBM50098768
Substrate/Competitorn/a
Meas. Tech.ChEMBL_96779 (CHEMBL705405)
IC50 120±n/a nM
Citation Liu, GHuth, JROlejniczak, ETMendoza, RDeVries, PLeitza, SReilly, EBOkasinski, GFFesik, SWvon Geldern, TW Novel p-arylthio cinnamides as antagonists of leukocyte function-associated antigen-1/intracellular adhesion molecule-1 interaction. 2. Mechanism of inhibition and structure-based improvement of pharmaceutical properties. J Med Chem44:1202-10 (2001) Integrin alpha-L/beta-2
Name:Integrin alpha-L/beta-2
Type:n/a
Mol. Mass.:n/a
Description:ASSAY_ID of EBI is 32646
Components:This complex has 2 components.
Component 1
Name:Integrin alpha-L
Synonyms:CD11 antigen-like family member A CD_antigen=CD11a ITGAL LFA-1A Leukocyte adhesion glycoprotein LFA-1 alpha chain | Leukocyte function-associated molecule 1 alpha chain
Type:PROTEIN
Mol. Mass.:128748.90
Organism:Homo sapiens (Human)
Description:ChEMBL_629045
Residue:1170
Component 2
Name:Integrin beta-2
Synonyms:CD18 ITGB2 MFI7
Type:PROTEIN
Mol. Mass.:84785.60
Organism:Homo sapiens (Human)
Description:EBI_12662
Residue:769
BDBM50098768
NameBDBM50098768
Synonyms:1-(4-Acetyl-piperazin-1-yl)-3-[4-(benzo[1,3]dioxol-5-ylsulfanyl)-3-chloro-phenyl]-propenone | CHEMBL19461
TypeSmall organic molecule
Emp. Form.C22H21ClN2O4S
Mol. Mass.444.931
SMILESCC(=O)N1CCN(CC1)C(=O)\C=C\c1ccc(Sc2ccc3OCOc3c2)c(Cl)c1