Reaction Details
TargetIntegrin alpha-L/beta-2
LigandBDBM50098769
Substrate/Competitorn/a
Meas. Tech.ChEMBL_96786 (CHEMBL703096)
IC50 100±n/a nM
Citation Liu, GHuth, JROlejniczak, ETMendoza, RDeVries, PLeitza, SReilly, EBOkasinski, GFFesik, SWvon Geldern, TW Novel p-arylthio cinnamides as antagonists of leukocyte function-associated antigen-1/intracellular adhesion molecule-1 interaction. 2. Mechanism of inhibition and structure-based improvement of pharmaceutical properties. J Med Chem44:1202-10 (2001) Integrin alpha-L/beta-2
Name:Integrin alpha-L/beta-2
Type:n/a
Mol. Mass.:n/a
Description:ASSAY_ID of EBI is 32646
Components:This complex has 2 components.
Component 1
Name:Integrin alpha-L
Synonyms:CD11 antigen-like family member A CD_antigen=CD11a ITGAL LFA-1A Leukocyte adhesion glycoprotein LFA-1 alpha chain | Leukocyte function-associated molecule 1 alpha chain
Type:PROTEIN
Mol. Mass.:128748.90
Organism:Homo sapiens (Human)
Description:ChEMBL_629045
Residue:1170
Component 2
Name:Integrin beta-2
Synonyms:CD18 ITGB2 MFI7
Type:PROTEIN
Mol. Mass.:84785.60
Organism:Homo sapiens (Human)
Description:EBI_12662
Residue:769
BDBM50098769
NameBDBM50098769
Synonyms:1-(4-Acetyl-piperazin-1-yl)-3-[3-chloro-4-(5-ethoxy-2,3-dihydro-benzo[1,4]dioxin-6-ylsulfanyl)-phenyl]-propenone | CHEMBL19856
TypeSmall organic molecule
Emp. Form.C25H27ClN2O5S
Mol. Mass.503.01
SMILESCCOc1c(Sc2ccc(\C=C\C(=O)N3CCN(CC3)C(C)=O)cc2Cl)ccc2OCCOc12