Reaction Details
TargetLysosomal acid glucosylceramidase
LigandBDBM50099006
Substrate/Competitorn/a
Meas. Tech.ChEBML_37421
Ki 1.2±n/a nM
Citation Wrodnigg, TMWithers, SGStütz, AE Novel, lipophilic derivatives of 2,5-dideoxy-2,5-imino-D-mannitol (DMDP) are powerful beta-glucosidase inhibitors. Bioorg Med Chem Lett11:1063-4 (2001) Lysosomal acid glucosylceramidase
Name:Lysosomal acid glucosylceramidase
Type:Enzyme
Mol. Mass.:59724.64
Organism:Homo sapiens (Human)
Description:The beta-Glu activity was measured with commercially available beta-glucocerebrosidase (Ceredase) as the enzyme source.
Residue:536
BDBM50099006
NameBDBM50099006
Synonyms:7-Diethylamino-2-oxo-2H-chromene-3-carboxylic acid ((R)-(3R,5S)-3,4-dihydroxy-5-hydroxymethyl-pyrrolidin-2-ylmethyl)-amide | CHEMBL3350092
TypeSmall organic molecule
Emp. Form.C20H27N3O6
Mol. Mass.405.4449
SMILESCCN(CC)c1ccc2cc(C(=O)NC[C@H]3N[C@H](CO)[C@H](O)[C@@H]3O)c(=O)oc2c1