Reaction Details
Target5-hydroxytryptamine receptor 1A
LigandBDBM50099016
Substrate/Competitorn/a
Meas. Tech.ChEBML_895
Ki 0.800000±n/a nM
Citation Sabb, ALVogel, RLKelly, MGPalmer, YSmith, DLAndree, THSchechter, LE 1,2,5-Thiadiazole derivatives are potent and selective ligands at human 5-HT1A receptors. Bioorg Med Chem Lett11:1069-71 (2001) 5-hydroxytryptamine receptor 1A
Name:5-hydroxytryptamine receptor 1A
Type:n/a
Mol. Mass.:46122.49
Organism:Homo sapiens (Human)
Description:n/a
Residue:422
BDBM50099016
NameBDBM50099016
Synonyms:CHEMBL275964 | Cyclohexanecarboxylic acid {(S)-1-benzyl-2-[4-(4-chloro-[1,2,5]thiadiazol-3-yl)-piperazin-1-yl]-ethyl}-amide
TypeSmall organic molecule
Emp. Form.C22H30ClN5OS
Mol. Mass.448.025
SMILESClc1nsnc1N1CCN(C[C@H](Cc2ccccc2)NC(=O)C2CCCCC2)CC1