Reaction Details
TargetProtein kinase C delta type
LigandBDBM50099065
Substrate/Competitorn/a
Meas. Tech.ChEBML_217858
Ki 1630±n/a nM
Citation Qiao, LZhao, LYRong, SBWu, XWWang, SFujii, TKazanietz, MGRauser, LSavage, JRoth, BLFlippen-Anderson, JKozikowski, AP Rational design, synthesis, and biological evaluation of rigid pyrrolidone analogues as potential inhibitors of prostate cancer cell growth. Bioorg Med Chem Lett11:955-9 (2001) Protein kinase C delta type
Name:Protein kinase C delta type
Type:Enzyme
Mol. Mass.:77516.79
Organism:Homo sapiens (Human)
Description:The recombinant human PKC enzymes were produced using a baculovirus expression system in SF9 cells
Residue:676
BDBM50099065
NameBDBM50099065
Synonyms:(3S,3aR,8R,8aS)-6-Dec-1-ynyl-3-hydroxymethyl-8-isopropyl-8-methyl-3,3a,8,8a-tetrahydro-2H-indeno[1,2-c]pyrrol-1-one | CHEMBL440201
TypeSmall organic molecule
Emp. Form.C26H37NO2
Mol. Mass.395.5775
SMILESCCCCCCCCC#Cc1ccc2[C@@H]3[C@@H](CO)NC(=O)[C@@H]3[C@@](C)(C(C)C)c2c1