Reaction Details
TargetProtein kinase C delta type
LigandBDBM50099066
Substrate/Competitorn/a
Meas. Tech.ChEBML_217858
Ki 0.800000±n/a nM
Citation Qiao, LZhao, LYRong, SBWu, XWWang, SFujii, TKazanietz, MGRauser, LSavage, JRoth, BLFlippen-Anderson, JKozikowski, AP Rational design, synthesis, and biological evaluation of rigid pyrrolidone analogues as potential inhibitors of prostate cancer cell growth. Bioorg Med Chem Lett11:955-9 (2001) Protein kinase C delta type
Name:Protein kinase C delta type
Type:Enzyme
Mol. Mass.:77516.79
Organism:Homo sapiens (Human)
Description:The recombinant human PKC enzymes were produced using a baculovirus expression system in SF9 cells
Residue:676
BDBM50099066
NameBDBM50099066
Synonyms:CHEMBL279115 | phorbol 13-acetate 12-myristate
TypeSmall organic molecule
Emp. Form.C36H56O8
Mol. Mass.616.825
(=O)O[C@@H]1[C@@H](C)[C@]2(O)[C@@H]3C=C(C)C(=O)[C@@]3(O)CC(CO)=C[C@H]2[C@@H]2C(C)(C)[C@]12OC(C)=O