Reaction Details
TargetIntegrin alpha-L/Integrin beta-2/Intercellular adhesion molecule 1
LigandBDBM50099128
Substrate/Competitorn/a
Meas. Tech.ChEMBL_96794 (CHEMBL703271)
IC50 13±n/a nM
Citation Link, JTSorensen, BLiu, GPei, ZReilly, EBLeitza, SOkasinski, G Discovery and SAR of diarylsulfide cyclopropylamide LFA-1/ICAM-1 interaction antagonists. Bioorg Med Chem Lett11:973-6 (2001) Integrin alpha-L/Integrin beta-2/Intercellular adhesion molecule 1
Name:Integrin alpha-L/Integrin beta-2/Intercellular adhesion molecule 1
Type:n/a
Mol. Mass.:n/a
Description:ASSAY_ID of EBI is 97281
Components:This complex has 3 components.
Component 1
Name:Integrin alpha-L
Synonyms:CD11 antigen-like family member A CD_antigen=CD11a ITGAL LFA-1A Leukocyte adhesion glycoprotein LFA-1 alpha chain | Leukocyte function-associated molecule 1 alpha chain
Type:PROTEIN
Mol. Mass.:128748.90
Organism:Homo sapiens (Human)
Description:ChEMBL_629045
Residue:1170
Component 2
Name:Intercellular adhesion molecule 1
Synonyms:CD_antigen=CD54 ICAM1 Intercellular adhesion molecule (ICAM-1), Integrin alpha-L/beta-2 Intercellular adhesion molecule-1 | Major group rhinovirus receptor
Type:PROTEIN
Mol. Mass.:57831.10
Organism:Homo sapiens (Human)
Description:ChEMBL_826675
Residue:532
Component 3
Name:Integrin beta-2
Synonyms:CD18 ITGB2 MFI7
Type:PROTEIN
Mol. Mass.:84785.60
Organism:Homo sapiens (Human)
Description:EBI_12662
Residue:769
BDBM50099128
NameBDBM50099128
Synonyms:1-{2-[2,3-Dichloro-4-(2-isopropyl-phenylsulfanyl)-phenyl]-cyclopropanecarbonyl}-piperidine-2-carboxylic acid | CHEMBL174858
TypeSmall organic molecule
Emp. Form.C25H27Cl2NO3S
Mol. Mass.492.458
SMILESCC(C)c1ccccc1Sc1ccc(C2CC2C(=O)N2CCCCC2C(O)=O)c(Cl)c1Cl