Reaction Details
TargetNeuropeptide Y receptor type 1
LigandBDBM50099202
Substrate/Competitorn/a
Meas. Tech.ChEMBL_140783 (CHEMBL752772)
Ki 34.8±n/a nM
Citation Balasubramaniam, ADhawan, VCMullins, DEChance, WTSheriff, SGuzzi, MPrabhakaran, MParker, EM Highly selective and potent neuropeptide Y (NPY) Y1 receptor antagonists based on [Pro(30), Tyr(32), Leu(34)]NPY(28-36)-NH2 (BW1911U90). J Med Chem44:1479-82 (2001) Neuropeptide Y receptor type 1
Name:Neuropeptide Y receptor type 1
Type:Enzyme Catalytic Domain
Mol. Mass.:44399.07
Organism:Homo sapiens (Human)
Description:NPY-Y1 NPY1R HUMAN::P25929
Residue:384
BDBM50099202
NameBDBM50099202
Synonyms:CHEMBL265391 | Ile-Asn-Pro-Ile-Tyr-Arg-Leu-Arg-(CH2-NH)Tyr-NH2
TypeSmall organic molecule
Emp. Form.C57H93N17O11
Mol. Mass.1192.4556
SMILESCC[C@H](C)[C@H](N)C(=O)N[C@@H](CC(N)=O)C(=O)N1CCC[C@H]1C(=O)N[C@@H]([C@@H](C)CC)C(=O)N[C@@H](Cc1ccc(O)cc1)C(=O)N[C@@H](CCCNC(N)=N)C(=O)N[C@@H](CC(C)C)C(=O)N[C@@H](CCCNC(N)=N)CN[C@@H](Cc1ccc(O)cc1)C(N)=O