Reaction Details
TargetNeuropeptide Y receptor type 1
LigandBDBM50099197
Substrate/Competitorn/a
Meas. Tech.ChEMBL_140781 (CHEMBL752770)
Ki 0.27±n/a nM
Citation Balasubramaniam, ADhawan, VCMullins, DEChance, WTSheriff, SGuzzi, MPrabhakaran, MParker, EM Highly selective and potent neuropeptide Y (NPY) Y1 receptor antagonists based on [Pro(30), Tyr(32), Leu(34)]NPY(28-36)-NH2 (BW1911U90). J Med Chem44:1479-82 (2001) Neuropeptide Y receptor type 1
Name:Neuropeptide Y receptor type 1
Type:Enzyme Catalytic Domain
Mol. Mass.:44399.07
Organism:Homo sapiens (Human)
Description:NPY-Y1 NPY1R HUMAN::P25929
Residue:384
BDBM50099197
NameBDBM50099197
Synonyms:CHEMBL411117 | Ile-Glu-Pro-Dpr-Tyr-Arg-Leu-Arg-Tyr-OMeIle-Glu-Pro-Dpr-Tyr-Arg-Leu-Arg-Tyr-OMe
TypeSmall organic molecule
Emp. Form.C112H172N32O26
Mol. Mass.2382.7629
SMILESCC[C@H](C)[C@H](N)C(=O)N[C@@H]1CCC(=O)NC[C@@H](NC(=O)[C@@H]2CCCN2C(=O)[C@H](CCC(=O)NC[C@H](NC(=O)[C@@H]2CCCN2C1=O)C(=O)N[C@@H](Cc1ccc(O)cc1)C(=O)N[C@@H](CCCNC(N)=N)C(=O)N[C@@H](CC(C)C)C(=O)N[C@@H](CCCNC(N)=N)C(=O)N[C@@H](Cc1ccc(O)cc1)C(=O)OC)NC(=O)[C@@H](N)[C@@H](C)CC)C(=O)N[C@@H](Cc1ccc(O)cc1)C(=O)N[C@@H](CCCNC(N)=N)C(=O)N[C@@H](CC(C)C)C(=O)N[C@@H](CCCNC(N)=N)C(=O)N[C@@H](Cc1ccc(O)cc1)C(=O)OC