Reaction Details
Target5-hydroxytryptamine receptor 2A
LigandBDBM50099255
Substrate/Competitorn/a
Meas. Tech.ChEMBL_2277 (CHEMBL617063)
Ki 0.09±n/a nM
Citation Rowley, MHallett, DJGoodacre, SMoyes, CCrawforth, JSparey, TJPatel, SMarwood, RPatel, SThomas, SHitzel, LO'Connor, DSzeto, NCastro, JLHutson, PHMacLeod, AM 3-(4-Fluoropiperidin-3-yl)-2-phenylindoles as high affinity, selective, and orally bioavailable h5-HT(2A) receptor antagonists. J Med Chem44:1603-14 (2001) 5-hydroxytryptamine receptor 2A
Name:5-hydroxytryptamine receptor 2A
Type:undefined
Mol. Mass.:52607.65
Organism:Homo sapiens (Human)
Description:P28223
Residue:471
BDBM50099255
NameBDBM50099255
Synonyms:6-Fluoro-2-(4-fluoro-phenyl)-3-piperidin-3-yl-1H-indole CHEMBL296512
TypeSmall organic molecule
Emp. Form.C19H18F2N2
Mol. Mass.312.3564
SMILESFc1ccc(cc1)-c1[nH]c2cc(F)ccc2c1C1CCCNC1