Reaction Details
Target5-hydroxytryptamine receptor 2A
LigandBDBM50099260
Substrate/Competitorn/a
Meas. Tech.ChEMBL_2277 (CHEMBL617063)
Ki 0.43±n/a nM
Citation Rowley, MHallett, DJGoodacre, SMoyes, CCrawforth, JSparey, TJPatel, SMarwood, RPatel, SThomas, SHitzel, LO'Connor, DSzeto, NCastro, JLHutson, PHMacLeod, AM 3-(4-Fluoropiperidin-3-yl)-2-phenylindoles as high affinity, selective, and orally bioavailable h5-HT(2A) receptor antagonists. J Med Chem44:1603-14 (2001) 5-hydroxytryptamine receptor 2A
Name:5-hydroxytryptamine receptor 2A
Type:undefined
Mol. Mass.:52607.65
Organism:Homo sapiens (Human)
Description:P28223
Residue:471
BDBM50099260
NameBDBM50099260
Synonyms:3-(4-Fluoro-piperidin-3-yl)-2-phenyl-1H-indole | CHEMBL41767
TypeSmall organic molecule
Emp. Form.C19H19FN2
Mol. Mass.294.366
SMILESF[C@@H]1CCNCC1c1c([nH]c2ccccc12)-c1ccccc1