Reaction Details
TargetPeroxisome proliferator-activated receptor delta
LigandBDBM50099491
Substrate/Competitorn/a
Meas. Tech.ChEBML_139552
EC50 2900±n/a nM
Citation Brown, PJStuart, LWHurley, KPLewis, MCWinegar, DAWilson, JGWilkison, WOIttoop, ORWillson, TM Identification of a subtype selective human PPARalpha agonist through parallel-array synthesis. Bioorg Med Chem Lett11:1225-7 (2001) Peroxisome proliferator-activated receptor delta
Name:Peroxisome proliferator-activated receptor delta
Type:PROTEIN
Mol. Mass.:49719.14
Organism:Mus musculus
Description:ChEMBL_1288931
Residue:440
BDBM50099491
NameBDBM50099491
Synonyms:2-(4-(2-(3-cyclohexyl-1-(4-cyclohexylbutyl)ureido)ethyl)phenylthio)-2-methylpropanoic acid CHEMBL21241 cid_3392731
TypeSmall organic molecule
Emp. Form.C29H46N2O3S
Mol. Mass.502.752
SMILESCC(C)(Sc1ccc(CCN(CCCCC2CCCCC2)C(=O)NC2CCCCC2)cc1)C(O)=O