Reaction Details
TargetSubstance-P receptor
LigandBDBM50099509
Substrate/Competitorn/a
Meas. Tech.ChEMBL_141776 (CHEMBL872729)
IC50 1±n/a nM
Citation Cooper, LCChicchi, GGDinnell, KElliott, JMHollingworth, GJKurtz, MMLocker, KLMorrison, DShaw, DETsao, KLWatt, APWilliams, ARSwain, CJ 2-Aryl indole NK1 receptor antagonists: optimisation of indole substitution. Bioorg Med Chem Lett11:1233-6 (2001) Substance-P receptor
Name:Substance-P receptor
Type:G Protein-Coupled Receptor (GPCR)
Mol. Mass.:46254.43
Organism:Homo sapiens (Human)
Description:P25103
Residue:407
BDBM50099509
NameBDBM50099509
Synonyms:3-[2-(4-Bromo-phenyl)-5-methyl-1H-indol-3-yl]-1-[4-(2-methoxy-phenyl)-piperazin-1-yl]-propan-1-one | CHEMBL21815
TypeSmall organic molecule
Emp. Form.C29H30BrN3O2
Mol. Mass.532.471
SMILESCOc1ccccc1N1CCN(CC1)C(=O)CCc1c([nH]c2ccc(C)cc12)-c1ccc(Br)cc1