Reaction Details
TargetSubstance-P receptor
LigandBDBM50099512
Substrate/Competitorn/a
Meas. Tech.ChEBML_141776
IC50 0.600000±n/a nM
Citation Cooper, LCChicchi, GGDinnell, KElliott, JMHollingworth, GJKurtz, MMLocker, KLMorrison, DShaw, DETsao, KLWatt, APWilliams, ARSwain, CJ 2-Aryl indole NK1 receptor antagonists: optimisation of indole substitution. Bioorg Med Chem Lett11:1233-6 (2001) Substance-P receptor
Name:Substance-P receptor
Type:G Protein-Coupled Receptor (GPCR)
Mol. Mass.:46254.43
Organism:Homo sapiens (Human)
Description:P25103
Residue:407
BDBM50099512
NameBDBM50099512
Synonyms:3-[2-(4-Chloro-phenyl)-5-methyl-1H-indol-3-yl]-1-[4-(2-methoxy-phenyl)-piperazin-1-yl]-propan-1-one | CHEMBL424586
TypeSmall organic molecule
Emp. Form.C29H30ClN3O2
Mol. Mass.488.02
SMILESCOc1ccccc1N1CCN(CC1)C(=O)CCc1c([nH]c2ccc(C)cc12)-c1ccc(Cl)cc1