Reaction Details
TargetSubstance-K receptor
LigandBDBM50099627
Substrate/Competitorn/a
Meas. Tech.ChEMBL_209033 (CHEMBL818108)
Ki 6.1±n/a nM
Citation Blaney, FERaveglia, LFArtico, MCavagnera, SDartois, CFarina, CGrugni, MGagliardi, SLuttmann, MAMartinelli, MNadler, GMParini, CPetrillo, PSarau, HMScheideler, MAHay, DWGiardina, GA Stepwise modulation of neurokinin-3 and neurokinin-2 receptor affinity and selectivity in quinoline tachykinin receptor antagonists. J Med Chem44:1675-89 (2001) Substance-K receptor
Name:Substance-K receptor
Type:Protein
Mol. Mass.:44455.78
Organism:Homo sapiens (Human)
Description:P21452
Residue:398
BDBM50099627
NameBDBM50099627
Synonyms:3-Morpholin-4-ylmethyl-2-phenyl-quinoline-4-carboxylic acid (1-cyclohexyl-ethyl)-amide | CHEMBL47179
TypeSmall organic molecule
Emp. Form.C29H35N3O2
Mol. Mass.457.6071
SMILESC[C@H](NC(=O)c1c(CN2CCOCC2)c(nc2ccccc12)-c1ccccc1)C1CCCCC1