Reaction Details
TargetNeuromedin-K receptor
LigandBDBM50099631
Substrate/Competitorn/a
Meas. Tech.ChEMBL_220885 (CHEMBL824640)
Ki 0.8±n/a nM
Citation Blaney, FERaveglia, LFArtico, MCavagnera, SDartois, CFarina, CGrugni, MGagliardi, SLuttmann, MAMartinelli, MNadler, GMParini, CPetrillo, PSarau, HMScheideler, MAHay, DWGiardina, GA Stepwise modulation of neurokinin-3 and neurokinin-2 receptor affinity and selectivity in quinoline tachykinin receptor antagonists. J Med Chem44:1675-89 (2001) Neuromedin-K receptor
Name:Neuromedin-K receptor
Type:Enzyme
Mol. Mass.:52221.96
Organism:Homo sapiens (Human)
Description:P29371
Residue:465
BDBM50099631
NameBDBM50099631
Synonyms:3-(4-Morpholin-4-yl-piperidin-1-ylmethyl)-2-phenyl-quinoline-4-carboxylic acid (1-cyclohexyl-ethyl)-amide | CHEMBL45129
TypeSmall organic molecule
Emp. Form.C34H44N4O2
Mol. Mass.540.7388
SMILESC[C@H](NC(=O)c1c(CN2CCC(CC2)N2CCOCC2)c(nc2ccccc12)-c1ccccc1)C1CCCCC1