Reaction Details
TargetSubstance-K receptor
LigandBDBM50099640
Substrate/Competitorn/a
Meas. Tech.ChEMBL_209033 (CHEMBL818108)
Ki 1±n/a nM
Citation Blaney, FERaveglia, LFArtico, MCavagnera, SDartois, CFarina, CGrugni, MGagliardi, SLuttmann, MAMartinelli, MNadler, GMParini, CPetrillo, PSarau, HMScheideler, MAHay, DWGiardina, GA Stepwise modulation of neurokinin-3 and neurokinin-2 receptor affinity and selectivity in quinoline tachykinin receptor antagonists. J Med Chem44:1675-89 (2001) Substance-K receptor
Name:Substance-K receptor
Type:Protein
Mol. Mass.:44455.78
Organism:Homo sapiens (Human)
Description:P21452
Residue:398
BDBM50099640
NameBDBM50099640
Synonyms:3-[1,4']Bipiperidinyl-1'-ylmethyl-2-phenyl-quinoline-4-carboxylic acid (1,2,2-trimethyl-propyl)-amide SB-414240
TypeSmall organic molecule
Emp. Form.C33H44N4O
Mol. Mass.512.7287
SMILESC[C@H](NC(=O)c1c(CN2CCC(CC2)N2CCCCC2)c(nc2ccccc12)-c1ccccc1)C(C)(C)C