Reaction Details
TargetSubstance-K receptor
LigandBDBM50099629
Substrate/Competitorn/a
Meas. Tech.ChEMBL_209033 (CHEMBL818108)
Ki 18.5±n/a nM
Citation Blaney, FERaveglia, LFArtico, MCavagnera, SDartois, CFarina, CGrugni, MGagliardi, SLuttmann, MAMartinelli, MNadler, GMParini, CPetrillo, PSarau, HMScheideler, MAHay, DWGiardina, GA Stepwise modulation of neurokinin-3 and neurokinin-2 receptor affinity and selectivity in quinoline tachykinin receptor antagonists. J Med Chem44:1675-89 (2001) Substance-K receptor
Name:Substance-K receptor
Type:Protein
Mol. Mass.:44455.78
Organism:Homo sapiens (Human)
Description:P21452
Residue:398
BDBM50099629
NameBDBM50099629
Synonyms:3-(4-Isopropyl-piperazin-1-ylmethyl)-2-phenyl-quinoline-4-carboxylic acid (1-ethyl-propyl)-amide | CHEMBL297086
TypeSmall organic molecule
Emp. Form.C29H38N4O
Mol. Mass.458.6382
SMILESCCC(CC)NC(=O)c1c(CN2CCN(CC2)C(C)C)c(nc2ccccc12)-c1ccccc1