Reaction Details
TargetSubstance-K receptor
LigandBDBM50099633
Substrate/Competitorn/a
Meas. Tech.ChEMBL_209033 (CHEMBL818108)
Ki 172±n/a nM
Citation Blaney, FERaveglia, LFArtico, MCavagnera, SDartois, CFarina, CGrugni, MGagliardi, SLuttmann, MAMartinelli, MNadler, GMParini, CPetrillo, PSarau, HMScheideler, MAHay, DWGiardina, GA Stepwise modulation of neurokinin-3 and neurokinin-2 receptor affinity and selectivity in quinoline tachykinin receptor antagonists. J Med Chem44:1675-89 (2001) Substance-K receptor
Name:Substance-K receptor
Type:Protein
Mol. Mass.:44455.78
Organism:Homo sapiens (Human)
Description:P21452
Residue:398
BDBM50099633
NameBDBM50099633
Synonyms:3-Dimethylaminomethyl-2-phenyl-quinoline-4-carboxylic acid (1-phenyl-propyl)-amide | CHEMBL44722
TypeSmall organic molecule
Emp. Form.C28H29N3O
Mol. Mass.423.5494
SMILESCC[C@H](NC(=O)c1c(CN(C)C)c(nc2ccccc12)-c1ccccc1)c1ccccc1