Reaction Details
TargetSubstance-K receptor
LigandBDBM50099644
Substrate/Competitorn/a
Meas. Tech.ChEMBL_209033 (CHEMBL818108)
Ki 4.2±n/a nM
Citation Blaney, FERaveglia, LFArtico, MCavagnera, SDartois, CFarina, CGrugni, MGagliardi, SLuttmann, MAMartinelli, MNadler, GMParini, CPetrillo, PSarau, HMScheideler, MAHay, DWGiardina, GA Stepwise modulation of neurokinin-3 and neurokinin-2 receptor affinity and selectivity in quinoline tachykinin receptor antagonists. J Med Chem44:1675-89 (2001) Substance-K receptor
Name:Substance-K receptor
Type:Protein
Mol. Mass.:44455.78
Organism:Homo sapiens (Human)
Description:P21452
Residue:398
BDBM50099644
NameBDBM50099644
Synonyms:3-(4-Isopropyl-piperazin-1-ylmethyl)-2-phenyl-quinoline-4-carboxylic acid cyclohexylamide | CHEMBL45362
TypeSmall organic molecule
Emp. Form.C30H38N4O
Mol. Mass.470.6489
SMILESCC(C)N1CCN(Cc2c(nc3ccccc3c2C(=O)NC2CCCCC2)-c2ccccc2)CC1