Reaction Details
TargetMu-type opioid receptor
LigandBDBM50099626
Substrate/Competitorn/a
Meas. Tech.ChEMBL_149492 (CHEMBL757825)
Ki 919.0±n/a nM
Citation Blaney, FERaveglia, LFArtico, MCavagnera, SDartois, CFarina, CGrugni, MGagliardi, SLuttmann, MAMartinelli, MNadler, GMParini, CPetrillo, PSarau, HMScheideler, MAHay, DWGiardina, GA Stepwise modulation of neurokinin-3 and neurokinin-2 receptor affinity and selectivity in quinoline tachykinin receptor antagonists. J Med Chem44:1675-89 (2001) Mu-type opioid receptor
Name:Mu-type opioid receptor
Type:G Protein-Coupled Receptor (GPCR)
Mol. Mass.:44789.51
Organism:Homo sapiens (Human)
Description:P35372
Residue:400
BDBM50099626
NameBDBM50099626
Synonyms:3-[1,4']Bipiperidinyl-1'-ylmethyl-2-phenyl-quinoline-4-carboxylic acid (1-phenyl-propyl)-amide | CHEMBL47544
TypeSmall organic molecule
Emp. Form.C36H42N4O
Mol. Mass.546.7449
SMILESCC[C@H](NC(=O)c1c(CN2CCC(CC2)N2CCCCC2)c(nc2ccccc12)-c1ccccc1)c1ccccc1