Reaction Details
TargetAndrogen receptor
LigandBDBM50099680
Substrate/Competitorn/a
Meas. Tech.ChEMBL_36137 (CHEMBL648326)
Ki 80.9±n/a nM
Citation Marhefka, CAMoore, BMBishop, TCKirkovsky, LMukherjee, ADalton, JTMiller, DD Homology modeling using multiple molecular dynamics simulations and docking studies of the human androgen receptor ligand binding domain bound to testosterone and nonsteroidal ligands. J Med Chem44:1729-40 (2001) Androgen receptor
Name:Androgen receptor
Type:Receptor
Mol. Mass.:99185.27
Organism:Homo sapiens (Human)
Description:CHO cells were stably transfected with human AR gene.
Residue:920
BDBM50099680
NameBDBM50099680
Synonyms:(R)-N-(4-Amino-3-trifluoromethyl-phenyl)-3-bromo-2-hydroxy-2-methyl-propionamide N-(4-Amino-3-trifluoromethyl-phenyl)-3-bromo-2-hydroxy-2-methyl-propionamide
TypeSmall organic molecule
Emp. Form.C11H12BrF3N2O2
Mol. Mass.341.124
SMILESC[C@](O)(CBr)C(=O)Nc1ccc(N)c(c1)C(F)(F)F