Reaction Details
TargetD(3) dopamine receptor
LigandBDBM50099800
Substrate/Competitorn/a
Meas. Tech.ChEMBL_62749 (CHEMBL674590)
Ki 0.4±n/a nM
Citation Huang, YLuedtke, RRFreeman, RAWu, LMach, RH Synthesis and structure-activity relationships of naphthamides as dopamine D3 receptor ligands. J Med Chem44:1815-26 (2001) D(3) dopamine receptor
Name:D(3) dopamine receptor
Type:Protein
Mol. Mass.:49540.58
Organism:Rattus norvegicus (Rat)
Description:P19020
Residue:446
BDBM50099800
NameBDBM50099800
Synonyms:4-Bromo-1-methoxy-naphthalene-2-carboxylic acid (1-adamantan-2-yl-pyrrolidin-3-yl)-amide | CHEMBL52298
TypeSmall organic molecule
Emp. Form.C26H31BrN2O2
Mol. Mass.483.441
SMILESCOc1c(cc(Br)c2ccccc12)C(=O)N[C@H]1CCN(C1)C1[C@H]2C[C@@H]3C[C@@H](C[C@H]1C3)C2