Reaction Details
TargetD(2) dopamine receptor
LigandBDBM50099794
Substrate/Competitorn/a
Meas. Tech.ChEMBL_62231 (CHEMBL675742)
Ki 1.8±n/a nM
Citation Huang, YLuedtke, RRFreeman, RAWu, LMach, RH Synthesis and structure-activity relationships of naphthamides as dopamine D3 receptor ligands. J Med Chem44:1815-26 (2001) D(2) dopamine receptor
Name:D(2) dopamine receptor
Type:G Protein-Coupled Receptor (GPCR)
Mol. Mass.:50931.60
Organism:Rattus norvegicus (rat)
Description:P61169
Residue:444
BDBM50099794
NameBDBM50099794
Synonyms:4-Bromo-1-methoxy-naphthalene-2-carboxylic acid (1-cycloheptyl-pyrrolidin-3-yl)-amide | CHEMBL54667
TypeSmall organic molecule
Emp. Form.C23H29BrN2O2
Mol. Mass.445.393
SMILESCOc1c(cc(Br)c2ccccc12)C(=O)N[C@H]1CCN(C1)C1CCCCCC1